Target
Nuclear receptor subfamily 4 group A member 1
Ligand
BDBM42082
Substrate
Meas. Tech.
Fluorescence Polarization Dose Response Assay for TR3-Based Bcl-B Inhibitors
EC50
2950±4490 nM
Citation
 PubChem, PC Fluorescence Polarization Dose Response Assay for TR3-Based Bcl-B Inhibitors PubChem Bioassay (2008)[AID] 
Target
Name:
Nuclear receptor subfamily 4 group A member 1
Synonyms:
GFRP1 NAK1 NR4A1_HUMAN | nuclear receptor subfamily 4, group A, member 1
Type:
Enzyme Catalytic Domain
Mol. Mass.:
64467.13
Organism:
Homo sapiens (Human)
Description:
gi_27894344
Residue:
598
  
Inhibitor
Name:
BDBM42082
Synonyms:
BIM-0015618.P001 ammonium;8-anilinonaphthalene-1-sulfonate azanium;8-phenylazanylnaphthalene-1-sulfonate | cid_120066
Type:
Small organic molecule
Emp. Form.:
C16H12NO3S
Mol. Mass.:
298.337
SMILES:
[O-]S(=O)(=O)c1cccc2cccc(Nc3ccccc3)c12
: