Target
Nuclear receptor subfamily 4 group A member 1
Ligand
BDBM42100
Substrate
Meas. Tech.
Fluorescence Polarization Dose Response Assay for TR3-Based Bcl-B Inhibitors
EC50
7150±8370 nM
Citation
 PubChem, PC Fluorescence Polarization Dose Response Assay for TR3-Based Bcl-B Inhibitors PubChem Bioassay (2008)[AID] 
Target
Name:
Nuclear receptor subfamily 4 group A member 1
Synonyms:
GFRP1 NAK1 NR4A1_HUMAN | nuclear receptor subfamily 4, group A, member 1
Type:
Enzyme Catalytic Domain
Mol. Mass.:
64467.13
Organism:
Homo sapiens (Human)
Description:
gi_27894344
Residue:
598
  
Inhibitor
Name:
BDBM42100
Synonyms:
BIM-0027148.P001 | cid_4240945
Type:
Small organic molecule
Emp. Form.:
C17H15NO2
Mol. Mass.:
265.3065
SMILES:
OC(=O)C1Nc2ccc3ccccc3c2C2C=CCC12
: