Target
Nuclear receptor subfamily 4 group A member 1
Ligand
BDBM42120
Substrate
Meas. Tech.
Fluorescence Polarization Dose Response Assay for TR3-Based Bcl-B Inhibitors
EC50
10950±17120 nM
Citation
 PubChem, PC Fluorescence Polarization Dose Response Assay for TR3-Based Bcl-B Inhibitors PubChem Bioassay (2008)[AID] 
Target
Name:
Nuclear receptor subfamily 4 group A member 1
Synonyms:
GFRP1 NAK1 NR4A1_HUMAN | nuclear receptor subfamily 4, group A, member 1
Type:
Enzyme Catalytic Domain
Mol. Mass.:
64467.13
Organism:
Homo sapiens (Human)
Description:
gi_27894344
Residue:
598
  
Inhibitor
Name:
BDBM42120
Synonyms:
2-[2-[3,4-bis(oxidanyl)phenyl]-2-oxidanylidene-ethyl]sulfanyl-5-ethanoyl-6-methyl-pyridine-3-carbonitrile 5-acetyl-2-[[2-(3,4-dihydroxyphenyl)-2-keto-ethyl]thio]-6-methyl-nicotinonitrile BIM-0041208.P001 | cid_764910
Type:
Small organic molecule
Emp. Form.:
C17H14N2O4S
Mol. Mass.:
342.369
SMILES:
CC(=O)c1cc(C#N)c(SCC(=O)c2ccc(O)c(O)c2)nc1C
: