Target
Nuclear receptor subfamily 4 group A member 1
Ligand
BDBM41992
Substrate
Meas. Tech.
Fluorescence Polarization Dose Response Assay for TR3-Based Bcl-B Inhibitors
EC50
4440±4740 nM
Citation
 PubChem, PC Fluorescence Polarization Dose Response Assay for TR3-Based Bcl-B Inhibitors PubChem Bioassay (2008)[AID] 
Target
Name:
Nuclear receptor subfamily 4 group A member 1
Synonyms:
GFRP1 NAK1 NR4A1_HUMAN | nuclear receptor subfamily 4, group A, member 1
Type:
Enzyme Catalytic Domain
Mol. Mass.:
64467.13
Organism:
Homo sapiens (Human)
Description:
gi_27894344
Residue:
598
  
Inhibitor
Name:
BDBM41992
Synonyms:
8-acetamido-3a,4,5,9b-tetrahydro-3H-cyclopenta[c]quinoline-4-carboxylic acid cid_3115075
Type:
Small organic molecule
Emp. Form.:
C15H16N2O3
Mol. Mass.:
272.2991
SMILES:
CC(=O)Nc1ccc2NC(C3CC=CC3c2c1)C(O)=O
: