Target
UDP-3-O-acyl-N-acetylglucosamine deacetylase
Ligand
BDBM264931
Substrate
Meas. Tech.
P. aeruqinosa LpxC Inhibition Assay
pH
7.5±n/a
Temperature
298.15±n/a K
IC50
<0.001±n/a nM
Comments
extracted
Citation
 Fu, JJin, XKarur, SLaPointe, GLee, PSweeney, ZK Isoxazoline hydroxamic acid derivatives as LpxC inhibitors US Patent  US9718792 Publication Date 8/1/2017 
Target
Name:
UDP-3-O-acyl-N-acetylglucosamine deacetylase
Synonyms:
LPXC_PSEAE UDP-3-O-[3-hydroxymyristoyl] N-acetylglucosamine deacetylase UDP-3-O-[3-hydroxymyristoyl] N-acetylglucosamine deacetylase (LpxC) UDP-3-O-acyl-GlcNAc deacetylase (LpxC) lpxC
Type:
Enzyme
Mol. Mass.:
33428.15
Organism:
Pseudomonas aeruginosa
Description:
P47205
Residue:
303
  
Inhibitor
Name:
BDBM264931
Synonyms:
US9718792, 88
Type:
Small organic molecule
Emp. Form.:
C23H26F2N2O6S
Mol. Mass.:
496.524
SMILES:
C[C@@H](O)Cc1cc(F)c(c(F)c1)-c1ccc(cc1)C1=NO[C@@H](C[C@](C)(C(=O)NO)S(C)(=O)=O)C1
: