Target
Tyrosine-protein phosphatase YopH
Ligand
BDBM42251
Substrate
Meas. Tech.
YopH - IC50 determinations (10 point dose range)
IC50
45025.34485±n/a nM
Citation
 PubChem, PC YopH - IC50 determinations (10 point dose range) PubChem Bioassay (2008)[AID] 
Target
Name:
Tyrosine-protein phosphatase YopH
Synonyms:
YOPH_YEREN yopH
Type:
PROTEIN
Mol. Mass.:
50951.99
Organism:
Yersinia enterocolitica
Description:
ChEMBL_965525
Residue:
468
  
Inhibitor
Name:
BDBM42251
Synonyms:
(4E)-2-benzyl-4-(ethoxymethylene)isoquinoline-1,3-quinone (4E)-4-(ethoxymethylidene)-2-(phenylmethyl)isoquinoline-1,3-dione SMR000259520 | cid_2339359
Type:
Small organic molecule
Emp. Form.:
C19H17NO3
Mol. Mass.:
307.3432
SMILES:
CCO\C=C1\C(=O)N(Cc2ccccc2)C(=O)c2ccccc12
: