Target
Lysosomal acid glucosylceramidase
Ligand
BDBM42268
Substrate
Meas. Tech.
Dose response cell-based high throughput screening assay to identify enhancers of beta-glucosidase activity
EC50
>50000±n/a nM
Citation
 PubChem, PC Dose response cell-based high throughput screening assay to identify enhancers of beta-glucosidase activity PubChem Bioassay (2008)[AID] 
Target
Name:
Lysosomal acid glucosylceramidase
Synonyms:
Acid beta-glucosidase Beta-glucocerebrosidase D-glucosyl-N-acylsphingosine glucohydrolase GBA1 GC GLUC Glucosylceramidase (GBA) Glucosylceramidase precursor (Beta-glucocerebrosidase) (Acid beta-glucosidase) (D-glucosyl-N-acylsphingosine glucohydrolase) (Alglucerase) (Imiglucerase) beta-glucocerebrosidase (GCase)
Type:
Enzyme
Mol. Mass.:
59724.64
Organism:
Homo sapiens (Human)
Description:
The beta-Glu activity was measured with commercially available beta-glucocerebrosidase (Ceredase) as the enzyme source.
Residue:
536
  
Inhibitor
Name:
BDBM42268
Synonyms:
2-[4-(2-Ethoxy-phenyl)-5-(4-hydroxy-phenyl)-4H-[1,2,4]triazol-3-ylsulfanyl]-acetamide 2-[[4-(2-ethoxyphenyl)-5-(4-oxo-1-cyclohexa-2,5-dienylidene)-1H-1,2,4-triazol-3-yl]thio]acetamide 2-[[5-(4-ketocyclohexa-2,5-dien-1-ylidene)-4-o-phenetyl-1H-1,2,4-triazol-3-yl]thio]acetamide SMR000002769 | cid_5447470
Type:
Small organic molecule
Emp. Form.:
C18H18N4O3S
Mol. Mass.:
370.426
SMILES:
CCOc1ccccc1-n1c(SCC(N)=O)nnc1-c1ccc(O)cc1
: