Target
Lysosomal acid glucosylceramidase
Ligand
BDBM38381
Substrate
Meas. Tech.
Dose response cell-based high throughput screening assay to identify enhancers of beta-glucosidase activity
EC50
>50000±n/a nM
Citation
 PubChem, PC Dose response cell-based high throughput screening assay to identify enhancers of beta-glucosidase activity PubChem Bioassay (2008)[AID] 
Target
Name:
Lysosomal acid glucosylceramidase
Synonyms:
Acid beta-glucosidase Beta-glucocerebrosidase D-glucosyl-N-acylsphingosine glucohydrolase GBA1 GC GLUC Glucosylceramidase (GBA) Glucosylceramidase precursor (Beta-glucocerebrosidase) (Acid beta-glucosidase) (D-glucosyl-N-acylsphingosine glucohydrolase) (Alglucerase) (Imiglucerase) beta-glucocerebrosidase (GCase)
Type:
Enzyme
Mol. Mass.:
59724.64
Organism:
Homo sapiens (Human)
Description:
The beta-Glu activity was measured with commercially available beta-glucocerebrosidase (Ceredase) as the enzyme source.
Residue:
536
  
Inhibitor
Name:
BDBM38381
Synonyms:
1-(5,5-diketo-9-methoxy-benzo[c][1,2]benzothiazin-6-yl)ethanone 1-(9-methoxy-5,5-dioxobenzo[c][1,2]benzothiazin-6-yl)ethanone MLS000048564 cid_2314340
Type:
Small organic molecule
Emp. Form.:
C15H13NO4S
Mol. Mass.:
303.333
SMILES:
COc1ccc2N(C(C)=O)S(=O)(=O)c3ccccc3-c2c1
: