Target
Lysosomal acid glucosylceramidase
Ligand
BDBM42311
Substrate
Meas. Tech.
Dose response cell-based high throughput screening assay to identify enhancers of beta-glucosidase activity
EC50
>50000±n/a nM
Citation
 PubChem, PC Dose response cell-based high throughput screening assay to identify enhancers of beta-glucosidase activity PubChem Bioassay (2008)[AID] 
Target
Name:
Lysosomal acid glucosylceramidase
Synonyms:
Acid beta-glucosidase Beta-glucocerebrosidase D-glucosyl-N-acylsphingosine glucohydrolase GBA1 GC GLUC Glucosylceramidase (GBA) Glucosylceramidase precursor (Beta-glucocerebrosidase) (Acid beta-glucosidase) (D-glucosyl-N-acylsphingosine glucohydrolase) (Alglucerase) (Imiglucerase) beta-glucocerebrosidase (GCase)
Type:
Enzyme
Mol. Mass.:
59724.64
Organism:
Homo sapiens (Human)
Description:
The beta-Glu activity was measured with commercially available beta-glucocerebrosidase (Ceredase) as the enzyme source.
Residue:
536
  
Inhibitor
Name:
BDBM42311
Synonyms:
MLS000044160 N-cyclohexyl-2-(4-methylphenyl)-2-pyrrolidin-1-yl-ethanamide N-cyclohexyl-2-(p-tolyl)-2-pyrrolidino-acetamide cid_3235603
Type:
Small organic molecule
Emp. Form.:
C19H28N2O
Mol. Mass.:
300.4384
SMILES:
Cc1ccc(cc1)C(N1CCCC1)C(=O)NC1CCCCC1
: