Target
Lysosomal acid glucosylceramidase
Ligand
BDBM42316
Substrate
Meas. Tech.
Dose response cell-based high throughput screening assay to identify enhancers of beta-glucosidase activity
EC50
>50000±n/a nM
Citation
 PubChem, PC Dose response cell-based high throughput screening assay to identify enhancers of beta-glucosidase activity PubChem Bioassay (2008)[AID] 
Target
Name:
Lysosomal acid glucosylceramidase
Synonyms:
Acid beta-glucosidase Beta-glucocerebrosidase D-glucosyl-N-acylsphingosine glucohydrolase GBA1 GC GLUC Glucosylceramidase (GBA) Glucosylceramidase precursor (Beta-glucocerebrosidase) (Acid beta-glucosidase) (D-glucosyl-N-acylsphingosine glucohydrolase) (Alglucerase) (Imiglucerase) beta-glucocerebrosidase (GCase)
Type:
Enzyme
Mol. Mass.:
59724.64
Organism:
Homo sapiens (Human)
Description:
The beta-Glu activity was measured with commercially available beta-glucocerebrosidase (Ceredase) as the enzyme source.
Residue:
536
  
Inhibitor
Name:
BDBM42316
Synonyms:
1-oxo-2-[[oxo(pyridin-4-yl)methyl]amino]-4-isoquinolinecarboxylic acid methyl ester MLS000044460 cid_3236069 methyl 1-oxo-2-(pyridine-4-carbonylamino)isoquinoline-4-carboxylate | methyl 2-(isonicotinoylamino)-1-oxo-1,2-dihydroisoquinoline-4-carboxylate
Type:
Small organic molecule
Emp. Form.:
C17H13N3O4
Mol. Mass.:
323.3028
SMILES:
COC(=O)c1cn(NC(=O)c2ccncc2)c(=O)c2ccccc12
: