Target
Lysosomal acid glucosylceramidase
Ligand
BDBM42352
Substrate
Meas. Tech.
Dose response cell-based high throughput screening assay to identify enhancers of beta-glucosidase activity
EC50
>50000±n/a nM
Citation
 PubChem, PC Dose response cell-based high throughput screening assay to identify enhancers of beta-glucosidase activity PubChem Bioassay (2008)[AID] 
Target
Name:
Lysosomal acid glucosylceramidase
Synonyms:
Acid beta-glucosidase Beta-glucocerebrosidase D-glucosyl-N-acylsphingosine glucohydrolase GBA1 GC GLUC Glucosylceramidase (GBA) Glucosylceramidase precursor (Beta-glucocerebrosidase) (Acid beta-glucosidase) (D-glucosyl-N-acylsphingosine glucohydrolase) (Alglucerase) (Imiglucerase) beta-glucocerebrosidase (GCase)
Type:
Enzyme
Mol. Mass.:
59724.64
Organism:
Homo sapiens (Human)
Description:
The beta-Glu activity was measured with commercially available beta-glucocerebrosidase (Ceredase) as the enzyme source.
Residue:
536
  
Inhibitor
Name:
BDBM42352
Synonyms:
MLS000046419 N-(2-furfuryl)-5-[(2-methylbenzyl)sulfonylmethyl]-2-furamide N-(furan-2-ylmethyl)-5-[(2-methylphenyl)methylsulfonylmethyl]furan-2-carboxamide cid_3242263
Type:
Small organic molecule
Emp. Form.:
C19H19NO5S
Mol. Mass.:
373.423
SMILES:
Cc1ccccc1CS(=O)(=O)Cc1ccc(o1)C(=O)NCc1ccco1
: