Target
Lysosomal acid glucosylceramidase
Ligand
BDBM42355
Substrate
Meas. Tech.
Dose response cell-based high throughput screening assay to identify enhancers of beta-glucosidase activity
EC50
>50000±n/a nM
Citation
 PubChem, PC Dose response cell-based high throughput screening assay to identify enhancers of beta-glucosidase activity PubChem Bioassay (2008)[AID] 
Target
Name:
Lysosomal acid glucosylceramidase
Synonyms:
Acid beta-glucosidase Beta-glucocerebrosidase D-glucosyl-N-acylsphingosine glucohydrolase GBA1 GC GLUC Glucosylceramidase (GBA) Glucosylceramidase precursor (Beta-glucocerebrosidase) (Acid beta-glucosidase) (D-glucosyl-N-acylsphingosine glucohydrolase) (Alglucerase) (Imiglucerase) beta-glucocerebrosidase (GCase)
Type:
Enzyme
Mol. Mass.:
59724.64
Organism:
Homo sapiens (Human)
Description:
The beta-Glu activity was measured with commercially available beta-glucocerebrosidase (Ceredase) as the enzyme source.
Residue:
536
  
Inhibitor
Name:
BDBM42355
Synonyms:
3-(2,1,3-benzothiadiazol-4-ylsulfonylamino)-N-(1-benzylpiperidin-4-yl)propanamide 3-(2,1,3-benzothiadiazol-4-ylsulfonylamino)-N-[1-(phenylmethyl)piperidin-4-yl]propanamide N-(1-benzyl-4-piperidyl)-3-(piazthiol-4-ylsulfonylamino)propionamide SMR000022175 | cid_3242583
Type:
Small organic molecule
Emp. Form.:
C21H25N5O3S2
Mol. Mass.:
459.585
SMILES:
O=C(CCNS(=O)(=O)c1cccc2nsnc12)NC1CCN(Cc2ccccc2)CC1
: