Target
Lysosomal acid glucosylceramidase
Ligand
BDBM42381
Substrate
Meas. Tech.
Dose response cell-based high throughput screening assay to identify enhancers of beta-glucosidase activity
EC50
>50000±n/a nM
Citation
 PubChem, PC Dose response cell-based high throughput screening assay to identify enhancers of beta-glucosidase activity PubChem Bioassay (2008)[AID] 
Target
Name:
Lysosomal acid glucosylceramidase
Synonyms:
Acid beta-glucosidase Beta-glucocerebrosidase D-glucosyl-N-acylsphingosine glucohydrolase GBA1 GC GLUC Glucosylceramidase (GBA) Glucosylceramidase precursor (Beta-glucocerebrosidase) (Acid beta-glucosidase) (D-glucosyl-N-acylsphingosine glucohydrolase) (Alglucerase) (Imiglucerase) beta-glucocerebrosidase (GCase)
Type:
Enzyme
Mol. Mass.:
59724.64
Organism:
Homo sapiens (Human)
Description:
The beta-Glu activity was measured with commercially available beta-glucocerebrosidase (Ceredase) as the enzyme source.
Residue:
536
  
Inhibitor
Name:
BDBM42381
Synonyms:
3-benzyl-4-(2-furfuryl)-1H-1,2,4-triazole-5-thione 4-(2-furanylmethyl)-3-(phenylmethyl)-1H-1,2,4-triazole-5-thione 5-benzyl-4-(2-furylmethyl)-2,4-dihydro-3H-1,2,4-triazole-3-thione SMR000072751 | cid_891086
Type:
Small organic molecule
Emp. Form.:
C14H13N3OS
Mol. Mass.:
271.338
SMILES:
S=c1[nH]nc(Cc2ccccc2)n1Cc1ccco1
: