Target
Neuropeptide Y receptor type 1
Ligand
BDBM36851
Substrate
Meas. Tech.
Dose response cell-based screening assay for antagonists of neuropeptide Y receptor Y1 (NPY-Y1)
IC50
3205±n/a nM
Citation
 PubChem, PC Dose response cell-based screening assay for antagonists of neuropeptide Y receptor Y1 (NPY-Y1) PubChem Bioassay (2008)[AID] 
Target
Name:
Neuropeptide Y receptor type 1
Synonyms:
NPY-Y1 NPY1R NPYR neuropeptide Y receptor Y1
Type:
Enzyme Catalytic Domain
Mol. Mass.:
44399.07
Organism:
Homo sapiens (Human)
Description:
NPY-Y1 NPY1R HUMAN::P25929
Residue:
384
  
Inhibitor
Name:
BDBM36851
Synonyms:
MLS000072751 N-[5-(1-benzotriazolylmethyl)-1,3,4-thiadiazol-2-yl]-4-tert-butyl-N-ethylbenzamide N-[5-(benzotriazol-1-ylmethyl)-1,3,4-thiadiazol-2-yl]-4-tert-butyl-N-ethylbenzamide cid_649706
Type:
Small organic molecule
Emp. Form.:
C22H24N6OS
Mol. Mass.:
420.531
SMILES:
CCN(C(=O)c1ccc(cc1)C(C)(C)C)c1nnc(Cn2nnc3ccccc23)s1
: