Target
Neuropeptide Y receptor type 1
Ligand
BDBM42433
Substrate
Meas. Tech.
Dose response cell-based screening assay for antagonists of neuropeptide Y receptor Y1 (NPY-Y1)
IC50
18900±n/a nM
Citation
 PubChem, PC Dose response cell-based screening assay for antagonists of neuropeptide Y receptor Y1 (NPY-Y1) PubChem Bioassay (2008)[AID] 
Target
Name:
Neuropeptide Y receptor type 1
Synonyms:
NPY-Y1 NPY1R NPYR neuropeptide Y receptor Y1
Type:
Enzyme Catalytic Domain
Mol. Mass.:
44399.07
Organism:
Homo sapiens (Human)
Description:
NPY-Y1 NPY1R HUMAN::P25929
Residue:
384
  
Inhibitor
Name:
BDBM42433
Synonyms:
MLS000388782 N-tert-butyl-3-(phenoxymethyl)-2-benzofurancarboxamide SMR000254955 | cid_2669460
Type:
Small organic molecule
Emp. Form.:
C20H21NO3
Mol. Mass.:
323.3856
SMILES:
CC(C)(C)NC(=O)c1oc2ccccc2c1COc1ccccc1
: