Target
Neuropeptide Y receptor type 1
Ligand
BDBM42434
Substrate
Meas. Tech.
Dose response cell-based screening assay for antagonists of neuropeptide Y receptor Y1 (NPY-Y1)
IC50
>35000±n/a nM
Citation
 PubChem, PC Dose response cell-based screening assay for antagonists of neuropeptide Y receptor Y1 (NPY-Y1) PubChem Bioassay (2008)[AID] 
Target
Name:
Neuropeptide Y receptor type 1
Synonyms:
NPY-Y1 NPY1R NPYR neuropeptide Y receptor Y1
Type:
Enzyme Catalytic Domain
Mol. Mass.:
44399.07
Organism:
Homo sapiens (Human)
Description:
NPY-Y1 NPY1R HUMAN::P25929
Residue:
384
  
Inhibitor
Name:
BDBM42434
Synonyms:
MLS000563759 cid_3247244
Type:
Small organic molecule
Emp. Form.:
C37H34F4N4O4
Mol. Mass.:
674.6839
SMILES:
[H][C@]12CN(C(=O)c3ccccc3)[C@@](Cc3ccc(F)cc3)(C(=O)OC)[C@@]1([H])c1cc(C(=O)N3CCCC3)n(Cc3ccc(nc3)C(F)(F)F)c1C2
: