Target
Neuropeptide Y receptor type 1
Ligand
BDBM42451
Substrate
Meas. Tech.
Dose response cell-based screening assay for antagonists of neuropeptide Y receptor Y1 (NPY-Y1)
IC50
1938±n/a nM
Citation
 PubChem, PC Dose response cell-based screening assay for antagonists of neuropeptide Y receptor Y1 (NPY-Y1) PubChem Bioassay (2008)[AID] 
Target
Name:
Neuropeptide Y receptor type 1
Synonyms:
NPY-Y1 NPY1R NPYR neuropeptide Y receptor Y1
Type:
Enzyme Catalytic Domain
Mol. Mass.:
44399.07
Organism:
Homo sapiens (Human)
Description:
NPY-Y1 NPY1R HUMAN::P25929
Residue:
384
  
Inhibitor
Name:
BDBM42451
Synonyms:
5-hydroxy-1-methyl-4-(4-morpholinylmethyl)-2-[(phenylthio)methyl]-3-indolecarboxylic acid ethyl ester MLS000686738 cid_1283502 ethyl 5-hydroxy-1-methyl-4-(morpholin-4-ylmethyl)-2-(phenylsulfanylmethyl)indole-3-carboxylate | ethyl 5-hydroxy-1-methyl-4-(morpholin-4-ylmethyl)-2-[(phenylthio)methyl]-1H-indole-3-carboxylate
Type:
Small organic molecule
Emp. Form.:
C24H28N2O4S
Mol. Mass.:
440.555
SMILES:
CCOC(=O)c1c(CSc2ccccc2)n(C)c2ccc(O)c(CN3CCOCC3)c12
: