Target
Neuropeptide Y receptor type 2
Ligand
BDBM42443
Substrate
Meas. Tech.
Dose response counterscreen assay for neuropeptide Y receptor Y1 (NPY-Y1): Cell-based high throughput assay to measure NPY-Y2 antagonism
IC50
12280±n/a nM
Citation
 PubChem, PC Dose response counterscreen assay for neuropeptide Y receptor Y1 (NPY-Y1): Cell-based high throughput assay to measure NPY-Y2 antagonism PubChem Bioassay (2008)[AID] 
Target
Name:
Neuropeptide Y receptor type 2
Synonyms:
NPY-Y2 NPY2-R NPY2R_HUMAN Y2 receptor | neuropeptide Y receptor Y2
Type:
Enzyme Catalytic Domain
Mol. Mass.:
42734.65
Organism:
Homo sapiens (Human)
Description:
NPY-Y2 NPY2R HUMAN::P49146
Residue:
381
  
Inhibitor
Name:
BDBM42443
Synonyms:
2-(cyclohexylamino)-1-(2,2,4,7-tetramethyl-1-quinolinyl)ethanone;oxalic acid 2-(cyclohexylamino)-1-(2,2,4,7-tetramethylquinolin-1-yl)ethanone;ethanedioic acid MLS000709785 cid_16189737
Type:
Small organic molecule
Emp. Form.:
C21H30N2O
Mol. Mass.:
326.4757
SMILES:
CC1=CC(C)(C)N(C(=O)CNC2CCCCC2)c2cc(C)ccc12
: