Target
Neuropeptide Y receptor type 1
Ligand
BDBM42470
Substrate
Meas. Tech.
Dose response counterscreen for neuropeptide Y receptor Y2 (NPY-Y2): Cell-based high throughput assay to measure NPY-Y1 antagonism
IC50
7767±n/a nM
Citation
 PubChem, PC Dose response counterscreen for neuropeptide Y receptor Y2 (NPY-Y2): Cell-based high throughput assay to measure NPY-Y1 antagonism PubChem Bioassay (2008)[AID] 
Target
Name:
Neuropeptide Y receptor type 1
Synonyms:
NPY-Y1 NPY1R NPYR neuropeptide Y receptor Y1
Type:
Enzyme Catalytic Domain
Mol. Mass.:
44399.07
Organism:
Homo sapiens (Human)
Description:
NPY-Y1 NPY1R HUMAN::P25929
Residue:
384
  
Inhibitor
Name:
BDBM42470
Synonyms:
2-(3,4-dimethoxyphenyl)-5-(1-phenylethylamino)-1,3-oxazole-4-carbonitrile 2-(3,4-dimethoxyphenyl)-5-(1-phenylethylamino)oxazole-4-carbonitrile SMR000045764 | cid_664816
Type:
Small organic molecule
Emp. Form.:
C20H19N3O3
Mol. Mass.:
349.3832
SMILES:
COc1ccc(cc1OC)-c1nc(C#N)c(NC(C)c2ccccc2)o1
: