Target
Neuropeptide Y receptor type 1
Ligand
BDBM42480
Substrate
Meas. Tech.
Dose response counterscreen for neuropeptide Y receptor Y2 (NPY-Y2): Cell-based high throughput assay to measure NPY-Y1 antagonism
IC50
6664±n/a nM
Citation
 PubChem, PC Dose response counterscreen for neuropeptide Y receptor Y2 (NPY-Y2): Cell-based high throughput assay to measure NPY-Y1 antagonism PubChem Bioassay (2008)[AID] 
Target
Name:
Neuropeptide Y receptor type 1
Synonyms:
NPY-Y1 NPY1R NPYR neuropeptide Y receptor Y1
Type:
Enzyme Catalytic Domain
Mol. Mass.:
44399.07
Organism:
Homo sapiens (Human)
Description:
NPY-Y1 NPY1R HUMAN::P25929
Residue:
384
  
Inhibitor
Name:
BDBM42480
Synonyms:
5-(1-azepanyl)-2-[(4-chlorophenoxy)methyl]-1,3-oxazole-4-carbonitrile 5-(azepan-1-yl)-2-[(4-chloranylphenoxy)methyl]-1,3-oxazole-4-carbonitrile 5-(azepan-1-yl)-2-[(4-chlorophenoxy)methyl]oxazole-4-carbonitrile SMR000075408 | cid_714054
Type:
Small organic molecule
Emp. Form.:
C17H18ClN3O2
Mol. Mass.:
331.797
SMILES:
Clc1ccc(OCc2nc(C#N)c(o2)N2CCCCCC2)cc1
: