Target
Neuropeptide Y receptor type 1
Ligand
BDBM42500
Substrate
Meas. Tech.
Dose response counterscreen for neuropeptide Y receptor Y2 (NPY-Y2): Cell-based high throughput assay to measure NPY-Y1 antagonism
IC50
>35000±n/a nM
Citation
 PubChem, PC Dose response counterscreen for neuropeptide Y receptor Y2 (NPY-Y2): Cell-based high throughput assay to measure NPY-Y1 antagonism PubChem Bioassay (2008)[AID] 
Target
Name:
Neuropeptide Y receptor type 1
Synonyms:
NPY-Y1 NPY1R NPYR neuropeptide Y receptor Y1
Type:
Enzyme Catalytic Domain
Mol. Mass.:
44399.07
Organism:
Homo sapiens (Human)
Description:
NPY-Y1 NPY1R HUMAN::P25929
Residue:
384
  
Inhibitor
Name:
BDBM42500
Synonyms:
MLS000519710 N-(3-chlorophenyl)-2-(4-ethoxyphenyl)-6,7-dimethoxy-1-oxidanylidene-isoquinoline-4-carboxamide N-(3-chlorophenyl)-2-(4-ethoxyphenyl)-6,7-dimethoxy-1-oxoisoquinoline-4-carboxamide cid_5224712
Type:
Small organic molecule
Emp. Form.:
C26H23ClN2O5
Mol. Mass.:
478.924
SMILES:
CCOc1ccc(cc1)-n1cc(C(=O)Nc2cccc(Cl)c2)c2cc(OC)c(OC)cc2c1=O
: