Target
Neuropeptide Y receptor type 1
Ligand
BDBM42530
Substrate
Meas. Tech.
Dose response counterscreen for neuropeptide Y receptor Y2 (NPY-Y2): Cell-based high throughput assay to measure NPY-Y1 antagonism
IC50
5687±n/a nM
Citation
 PubChem, PC Dose response counterscreen for neuropeptide Y receptor Y2 (NPY-Y2): Cell-based high throughput assay to measure NPY-Y1 antagonism PubChem Bioassay (2008)[AID] 
Target
Name:
Neuropeptide Y receptor type 1
Synonyms:
NPY-Y1 NPY1R NPYR neuropeptide Y receptor Y1
Type:
Enzyme Catalytic Domain
Mol. Mass.:
44399.07
Organism:
Homo sapiens (Human)
Description:
NPY-Y1 NPY1R HUMAN::P25929
Residue:
384
  
Inhibitor
Name:
BDBM42530
Synonyms:
2-[(3,4-dichlorobenzyl)thio]-6-(3-pyridyl)nicotinonitrile 2-[(3,4-dichlorophenyl)methylsulfanyl]-6-pyridin-3-ylpyridine-3-carbonitrile 6-(3,4-Dichloro-benzylsulfanyl)-[2,3']bipyridinyl-5-carbonitrile SMR000218652 | cid_1543852
Type:
Small organic molecule
Emp. Form.:
C18H11Cl2N3S
Mol. Mass.:
372.271
SMILES:
Clc1ccc(CSc2nc(ccc2C#N)-c2cccnc2)cc1Cl
: