Target
Mitogen-activated protein kinase 10
Ligand
BDBM42818
Substrate
Meas. Tech.
Dose response biochemical screening assay for inhibitors of c-Jun N-Terminal Kinase 3 (JNK3)
IC50
929±n/a nM
Citation
 PubChem, PC Dose response biochemical screening assay for inhibitors of c-Jun N-Terminal Kinase 3 (JNK3) PubChem Bioassay (2008)[AID] 
Target
Name:
Mitogen-activated protein kinase 10
Synonyms:
JNK3 MAP kinase p49 3F12 MK10_HUMAN Mitogen-activated protein kinase 10 (Stress-activated protein kinase JNK3) (c-Jun N-terminal kinase 3) (MAP kinase p49 3F12) PRKM10 Stress-activated protein kinase JNK3 | c-Jun N-terminal kinase 3 (JNK3)
Type:
Enzyme
Mol. Mass.:
52586.89
Organism:
Homo sapiens (Human)
Description:
Residue:
464
  
Inhibitor
Name:
BDBM42818
Synonyms:
3-({4-[(4-phenyl-1-piperazinyl)carbonyl]cyclohexyl}methyl)-2-thioxo-2,3-dihydro-4(1H)-quinazolinone 3-[[4-(4-phenylpiperazine-1-carbonyl)cyclohexyl]methyl]-2-sulfanylidene-1H-quinazolin-4-one 3-[[4-[oxo-(4-phenyl-1-piperazinyl)methyl]cyclohexyl]methyl]-2-sulfanylidene-1H-quinazolin-4-one SMR000076048 | cid_2952511
Type:
Small organic molecule
Emp. Form.:
C26H30N4O2S
Mol. Mass.:
462.607
SMILES:
O=C(C1CCC(Cn2c(=S)[nH]c3ccccc3c2=O)CC1)N1CCN(CC1)c1ccccc1
: