Target
Apoptosis regulator Bcl-2
Ligand
BDBM31713
Substrate
Meas. Tech.
Multiplexed high-throughput screen for small molecule regulators of Bcl-2 family protein interactions, specifically Bim-Bcl-2
EC50
9260±n/a nM
Citation
 PubChem, PC Multiplexed high-throughput screen for small molecule regulators of Bcl-2 family protein interactions, specifically Bim-Bcl-2 PubChem Bioassay (2008)[AID] 
Target
Name:
Apoptosis regulator Bcl-2
Synonyms:
Apoptosis regulator Bcl-2 Protein BCL-2 BCL2_HUMAN | Bcl-2 Protein
Type:
Homodimer or heterodimer
Mol. Mass.:
26269.11
Organism:
Homo sapiens (Human)
Description:
P10415
Residue:
239
  
Inhibitor
Name:
BDBM31713
Synonyms:
1-Cyclopropyl-3-(2,3-di-furan-2-yl-quinoxalin-6-yl)-urea 1-[2,3-bis(2-furyl)quinoxalin-6-yl]-3-cyclopropyl-urea 1-[2,3-bis(furan-2-yl)quinoxalin-6-yl]-3-cyclopropylurea SMR000118524 | cid_1072898
Type:
Small organic molecule
Emp. Form.:
C20H16N4O3
Mol. Mass.:
360.366
SMILES:
O=C(NC1CC1)Nc1ccc2nc(-c3ccco3)c(nc2c1)-c1ccco1
: