Target
Apoptosis regulator Bcl-2
Ligand
BDBM32311
Substrate
Meas. Tech.
Multiplexed high-throughput screen for small molecule regulators of Bcl-2 family protein interactions, specifically Bim-Bcl-2
EC50
4670±n/a nM
Citation
 PubChem, PC Multiplexed high-throughput screen for small molecule regulators of Bcl-2 family protein interactions, specifically Bim-Bcl-2 PubChem Bioassay (2008)[AID] 
Target
Name:
Apoptosis regulator Bcl-2
Synonyms:
Apoptosis regulator Bcl-2 Protein BCL-2 BCL2_HUMAN | Bcl-2 Protein
Type:
Homodimer or heterodimer
Mol. Mass.:
26269.11
Organism:
Homo sapiens (Human)
Description:
P10415
Residue:
239
  
Inhibitor
Name:
BDBM32311
Synonyms:
MLS000390291 cid_7125637
Type:
Small organic molecule
Emp. Form.:
C23H19N3O3S
Mol. Mass.:
417.48
SMILES:
Nc1c(sc2nc3\C(CCc3c(-c3ccco3)c12)=C/c1ccco1)C(=O)NC1CC1
: