Target
Apoptosis regulator Bcl-2
Ligand
BDBM32314
Substrate
Meas. Tech.
Multiplexed high-throughput screen for small molecule regulators of Bcl-2 family protein interactions, specifically Bim-Bcl-2
EC50
17850±n/a nM
Citation
 PubChem, PC Multiplexed high-throughput screen for small molecule regulators of Bcl-2 family protein interactions, specifically Bim-Bcl-2 PubChem Bioassay (2008)[AID] 
Target
Name:
Apoptosis regulator Bcl-2
Synonyms:
Apoptosis regulator Bcl-2 Protein BCL-2 BCL2_HUMAN | Bcl-2 Protein
Type:
Homodimer or heterodimer
Mol. Mass.:
26269.11
Organism:
Homo sapiens (Human)
Description:
P10415
Residue:
239
  
Inhibitor
Name:
BDBM32314
Synonyms:
2-[4-[3-(1,2,3,5,6,7-hexahydro-s-indacen-4-yl)propyl]-1-piperazinyl]ethanol;hydrochloride 2-[4-[3-(1,2,3,5,6,7-hexahydro-s-indacen-4-yl)propyl]piperazino]ethanol;hydrochloride MLS000698424 cid_15945682
Type:
Small organic molecule
Emp. Form.:
C21H32N2O
Mol. Mass.:
328.4916
SMILES:
OCCN1CCN(CCCc2c3CCCc3cc3CCCc23)CC1
: