Target
Apoptosis regulator Bcl-2
Ligand
BDBM33157
Substrate
Meas. Tech.
Multiplexed high-throughput screen for small molecule regulators of Bcl-2 family protein interactions, specifically Bim-Bcl-2
EC50
15970±n/a nM
Citation
 PubChem, PC Multiplexed high-throughput screen for small molecule regulators of Bcl-2 family protein interactions, specifically Bim-Bcl-2 PubChem Bioassay (2008)[AID] 
Target
Name:
Apoptosis regulator Bcl-2
Synonyms:
Apoptosis regulator Bcl-2 Protein BCL-2 BCL2_HUMAN | Bcl-2 Protein
Type:
Homodimer or heterodimer
Mol. Mass.:
26269.11
Organism:
Homo sapiens (Human)
Description:
P10415
Residue:
239
  
Inhibitor
Name:
BDBM33157
Synonyms:
MLS000687602 [2,3-bis(2-furanyl)-6-quinoxalinyl]-phenylmethanone [2,3-bis(furan-2-yl)quinoxalin-6-yl]-phenyl-methanone cid_1037240
Type:
Small organic molecule
Emp. Form.:
C23H14N2O3
Mol. Mass.:
366.3689
SMILES:
O=C(c1ccccc1)c1ccc2nc(-c3ccco3)c(nc2c1)-c1ccco1
: