Target
Induced myeloid leukemia cell differentiation protein Mcl-1
Ligand
BDBM33136
Substrate
Meas. Tech.
Multiplexed dose response screen for small molecule regulators of Bcl-2 family protein interactions, specifically Bim-Mcl-1.
EC50
24180±n/a nM
Citation
 PubChem, PC Multiplexed dose response screen for small molecule regulators of Bcl-2 family protein interactions, specifically Bim-Mcl-1. PubChem Bioassay (2008)[AID] 
Target
Name:
Induced myeloid leukemia cell differentiation protein Mcl-1
Synonyms:
BCL2L3 Bcl-2-like protein 3 (Mcl-1) Bcl2-L-3 MCL1 Mcl-1 Myeloid cell leukemia sequence 1 (BCL2-related) | mcl1/EAT
Type:
Membrane; Single-pass membrane protein
Mol. Mass.:
37332.87
Organism:
Homo sapiens (Human)
Description:
Q07820
Residue:
350
  
Inhibitor
Name:
BDBM33136
Synonyms:
4-bromanyl-2-[(E)-3-(4-ethoxyphenyl)prop-2-enoyl]-7-(ethylamino)cyclohepta-2,4,6-trien-1-one 4-bromo-2-[(E)-3-(4-ethoxyphenyl)prop-2-enoyl]-7-(ethylamino)cyclohepta-2,4,6-trien-1-one 4-bromo-7-(ethylamino)-2-[(E)-3-p-phenetylacryloyl]cyclohepta-2,4,6-trien-1-one SMR000229853 | cid_7314643
Type:
Small organic molecule
Emp. Form.:
C20H20BrNO3
Mol. Mass.:
402.282
SMILES:
CCNc1ccc(Br)cc(C(=O)\C=C\c2ccc(OCC)cc2)c1=O
: