Target
Ras-related C3 botulinum toxin substrate 1
Ligand
BDBM43264
Substrate
Meas. Tech.
Multiplex dose response to identify specific small molecule inhibitors of Ras and Ras-related GTPases specifically Rac activated mutant
EC50
30110±n/a nM
Citation
 PubChem, PC Multiplex dose response to identify specific small molecule inhibitors of Ras and Ras-related GTPases specifically Rac activated mutant PubChem Bioassay (2010)[AID] 
Target
Name:
Ras-related C3 botulinum toxin substrate 1
Synonyms:
RAC1_MOUSE Rac1 protein
Type:
PROTEIN
Mol. Mass.:
21455.91
Organism:
Mus musculus
Description:
EBI_101485
Residue:
192
  
Inhibitor
Name:
BDBM43264
Synonyms:
2-[[(E)-3-(1,3-benzodioxol-5-yl)-1-oxoprop-2-enyl]amino]-4-ethyl-5-methyl-3-thiophenecarboxylic acid ethyl ester MLS000579661 cid_1022762 ethyl 2-[[(E)-3-(1,3-benzodioxol-5-yl)prop-2-enoyl]amino]-4-ethyl-5-methylthiophene-3-carboxylate | ethyl 2-{[3-(1,3-benzodioxol-5-yl)acryloyl]amino}-4-ethyl-5-methyl-3-thiophenecarboxylate
Type:
Small organic molecule
Emp. Form.:
C20H21NO5S
Mol. Mass.:
387.449
SMILES:
CCOC(=O)c1c(CC)c(C)sc1NC(=O)\C=C\c1ccc2OCOc2c1
: