Target
Ras-related C3 botulinum toxin substrate 1
Ligand
BDBM43214
Substrate
Meas. Tech.
Multiplex dose response to identify specific small molecule inhibitors of Ras and Ras-related GTPases specifically Rac activated mutant
EC50
29510±n/a nM
Citation
 PubChem, PC Multiplex dose response to identify specific small molecule inhibitors of Ras and Ras-related GTPases specifically Rac activated mutant PubChem Bioassay (2010)[AID] 
Target
Name:
Ras-related C3 botulinum toxin substrate 1
Synonyms:
RAC1_MOUSE Rac1 protein
Type:
PROTEIN
Mol. Mass.:
21455.91
Organism:
Mus musculus
Description:
EBI_101485
Residue:
192
  
Inhibitor
Name:
BDBM43214
Synonyms:
2-[(5-cyano-4-keto-6-phenyl-1H-pyrimidin-2-yl)thio]-N-phenyl-acetamide 2-[(5-cyano-4-oxo-6-phenyl-1H-pyrimidin-2-yl)sulfanyl]-N-phenylacetamide 2-[(5-cyano-6-oxo-4-phenyl-1,6-dihydropyrimidin-2-yl)thio]-N-phenylacetamide SMR000207514 | cid_4402099
Type:
Small organic molecule
Emp. Form.:
C19H14N4O2S
Mol. Mass.:
362.405
SMILES:
O=C(CSc1nc(-c2ccccc2)c(C#N)c(=O)[nH]1)Nc1ccccc1
: