Target
RAC-alpha serine/threonine-protein kinase
Ligand
BDBM32346
Substrate
Meas. Tech.
AKT counterscreen of confirmed PKD inhibitors-57K library
IC50
>100000±n/a nM
Citation
 PubChem, PC AKT counterscreen of confirmed PKD inhibitors-57K library PubChem Bioassay (2008)[AID] 
Target
Name:
RAC-alpha serine/threonine-protein kinase
Synonyms:
AKT phosphorylation (p-AKT) AKT1/PPP1CA C-AKT PKB alpha Protein kinase B Protein kinase B (Akt 1) Protein kinase B alpha Proto-oncogene Akt (Akt1) Proto-oncogene c-Akt (AKT1) RAC-PK-alpha RAC-alpha serine/threonine-protein kinase (AKT1) | RAC-alpha serine/threonine-protein kinase (pAKT)
Type:
Enzyme
Mol. Mass.:
55681.25
Organism:
Homo sapiens (Human)
Description:
P31749
Residue:
480
  
Inhibitor
Name:
BDBM32346
Synonyms:
2-[(3-methoxycarbonyl-5,6,7,8-tetrahydro-4H-cyclohepta[b]thiophen-2-yl)carbamoyl]bicyclo[2.2.1]heptane-3-carboxylic acid 3-({[3-(methoxycarbonyl)-5,6,7,8-tetrahydro-4H-cyclohepta[b]thien-2-yl]amino}carbonyl)bicyclo[2.2.1]heptane-2-carboxylic acid MLS000673690 cid_2887468
Type:
Small organic molecule
Emp. Form.:
C20H25NO5S
Mol. Mass.:
391.481
SMILES:
[H]C12CCC([H])(C1)C(C2C(O)=O)C(=O)Nc1sc2CCCCCc2c1C(=O)OC
: