Target
RAC-alpha serine/threonine-protein kinase
Ligand
BDBM32356
Substrate
Meas. Tech.
AKT counterscreen of confirmed PKD inhibitors-57K library
IC50
>100000±n/a nM
Citation
 PubChem, PC AKT counterscreen of confirmed PKD inhibitors-57K library PubChem Bioassay (2008)[AID] 
Target
Name:
RAC-alpha serine/threonine-protein kinase
Synonyms:
AKT phosphorylation (p-AKT) AKT1/PPP1CA C-AKT PKB alpha Protein kinase B Protein kinase B (Akt 1) Protein kinase B alpha Proto-oncogene Akt (Akt1) Proto-oncogene c-Akt (AKT1) RAC-PK-alpha RAC-alpha serine/threonine-protein kinase (AKT1) | RAC-alpha serine/threonine-protein kinase (pAKT)
Type:
Enzyme
Mol. Mass.:
55681.25
Organism:
Homo sapiens (Human)
Description:
P31749
Residue:
480
  
Inhibitor
Name:
BDBM32356
Synonyms:
2-amino-6-chloro-4-methyl-3,5-pyridinedicarbonitrile 2-amino-6-chloro-4-methylpyridine-3,5-dicarbonitrile MLS000692177 cid_606000
Type:
Small organic molecule
Emp. Form.:
C8H5ClN4
Mol. Mass.:
192.605
SMILES:
Cc1c(C#N)c(N)nc(Cl)c1C#N
: