Target
Cyclin-dependent kinase 7
Ligand
BDBM32354
Substrate
Meas. Tech.
CDK7 counterscreen of confirmed PKD inhibitors-57K library addition
IC50
>100000±n/a nM
Citation
 PubChem, PC CDK7 counterscreen of confirmed PKD inhibitors-57K library addition PubChem Bioassay (2008)[AID] 
Target
Name:
Cyclin-dependent kinase 7
Synonyms:
39 kDa protein kinase CAK1 CDK-activating kinase 1 (CAK) CDK7_HUMAN Cell division protein kinase 7 Cyclin-dependent kinase 7 (CDK7/cyclin H) P39 Mo15 TFIIH basal transcription factor complex kinase subunit
Type:
Enzyme Subunit
Mol. Mass.:
39047.01
Organism:
Homo sapiens (Human)
Description:
Residue:
346
  
Inhibitor
Name:
BDBM32354
Synonyms:
4-(cyclohexanecarbonyl)-1H-pyrrole-2-carboxylic acid 4-[cyclohexyl(oxo)methyl]-1H-pyrrole-2-carboxylic acid MLS000736313 cid_1482736
Type:
Small organic molecule
Emp. Form.:
C12H15NO3
Mol. Mass.:
221.2524
SMILES:
OC(=O)c1cc(c[nH]1)C(=O)C1CCCCC1
: