Target
Serine/threonine-protein kinase PLK1
Ligand
BDBM32340
Substrate
Meas. Tech.
PLK1 counterscreening assay for identified PKD inhibitors
IC50
>50000±n/a nM
Citation
 PubChem, PC PLK1 counterscreening assay for identified PKD inhibitors PubChem Bioassay (2008)[AID] 
Target
Name:
Serine/threonine-protein kinase PLK1
Synonyms:
PLK PLK1 Polo-like kinase 1 (PlK1) STPK13 Serine/threonine-protein kinase 13 | polo-like kinase
Type:
Serine/threonine-protein kinase
Mol. Mass.:
68277.16
Organism:
Homo sapiens (Human)
Description:
P53350
Residue:
603
  
Inhibitor
Name:
BDBM32340
Synonyms:
3-ethyl-6-methoxy-1H-benzo[de]cinnoline SMR000140796 | cid_2876479
Type:
Small organic molecule
Emp. Form.:
C14H14N2O
Mol. Mass.:
226.2738
SMILES:
CCc1n[nH]c2cccc3c(OC)ccc1c23
: