Target
DNA-directed RNA polymerase subunit beta
Ligand
BDBM43304
Substrate
Meas. Tech.
RNA polymerase SAR
IC50
19319±n/a nM
Citation
 PubChem, PC RNA polymerase SAR PubChem Bioassay (2008)[AID] 
Target
Name:
DNA-directed RNA polymerase subunit beta
Synonyms:
RNA polymerase beta subunit (EC 2.7.7.6)
Type:
Enzyme Catalytic Domain
Mol. Mass.:
150595.80
Organism:
Escherichia coli
Description:
A0A0E2LB94
Residue:
1342
  
Inhibitor
Name:
BDBM43304
Synonyms:
4-methoxy-N-(2-oxidanylnaphthalen-1-yl)benzenesulfonamide N-(2-hydroxy-1-naphthyl)-4-methoxy-benzenesulfonamide PC-0599227 cid_16738610
Type:
Small organic molecule
Emp. Form.:
C17H15NO4S
Mol. Mass.:
329.37
SMILES:
COc1ccc(cc1)S(=O)(=O)Nc1c(O)ccc2ccccc12
: