Target
DNA-directed RNA polymerase subunit beta
Ligand
BDBM43333
Substrate
Meas. Tech.
RNA polymerase SAR
IC50
29502±n/a nM
Citation
 PubChem, PC RNA polymerase SAR PubChem Bioassay (2008)[AID] 
Target
Name:
DNA-directed RNA polymerase subunit beta
Synonyms:
RNA polymerase beta subunit (EC 2.7.7.6)
Type:
Enzyme Catalytic Domain
Mol. Mass.:
150595.80
Organism:
Escherichia coli
Description:
A0A0E2LB94
Residue:
1342
  
Inhibitor
Name:
BDBM43333
Synonyms:
4-fluoranyl-N-(2-oxidanylnaphthalen-1-yl)benzenesulfonamide 4-fluoro-N-(2-hydroxy-1-naphthyl)benzenesulfonamide PC-0626778 cid_16738607
Type:
Small organic molecule
Emp. Form.:
C16H12FNO3S
Mol. Mass.:
317.335
SMILES:
Oc1ccc2ccccc2c1NS(=O)(=O)c1ccc(F)cc1
: