Target
E3 ubiquitin-protein ligase Mdm2
Ligand
BDBM43350
Substrate
Meas. Tech.
E3 Ligase dose-response_384
EC50
20370±n/a nM
Citation
 PubChem, PC E3 Ligase dose-response_384 PubChem Bioassay (2008)[AID] 
Target
Name:
E3 ubiquitin-protein ligase Mdm2
Synonyms:
Double minute 2 protein E3 ubiquitin-protein ligase Mdm2 (p53-binding protein Mdm2) Human Double Minute 2 (HDM2) MDM2-MDMX p53-Binding Protein MDM2 | p53-binding protein
Type:
Oncoprotein
Mol. Mass.:
55196.54
Organism:
Homo sapiens (Human)
Description:
Q00987
Residue:
491
  
Inhibitor
Name:
BDBM43350
Synonyms:
1-[2,5-dimethyl-1-(oxolan-2-ylmethyl)pyrrol-3-yl]-2-[(5-phenylazanyl-1,3,4-thiadiazol-2-yl)sulfanyl]ethanone 2-[(5-anilino-1,3,4-thiadiazol-2-yl)thio]-1-[2,5-dimethyl-1-(2-oxolanylmethyl)-3-pyrrolyl]ethanone MLS000058066 cid_2998364
Type:
Small organic molecule
Emp. Form.:
C21H24N4O2S2
Mol. Mass.:
428.571
SMILES:
Cc1cc(C(=O)CSc2nnc(Nc3ccccc3)s2)c(C)n1CC1CCCO1
: