Target
E3 ubiquitin-protein ligase Mdm2
Ligand
BDBM43418
Substrate
Meas. Tech.
E3 Ligase dose-response_384
EC50
7510±n/a nM
Citation
 PubChem, PC E3 Ligase dose-response_384 PubChem Bioassay (2008)[AID] 
Target
Name:
E3 ubiquitin-protein ligase Mdm2
Synonyms:
Double minute 2 protein E3 ubiquitin-protein ligase Mdm2 (p53-binding protein Mdm2) Human Double Minute 2 (HDM2) MDM2-MDMX p53-Binding Protein MDM2 | p53-binding protein
Type:
Oncoprotein
Mol. Mass.:
55196.54
Organism:
Homo sapiens (Human)
Description:
Q00987
Residue:
491
  
Inhibitor
Name:
BDBM43418
Synonyms:
2-[(3,5-dimethylbenzoyl)amino]acetic acid [2-keto-2-(2-methoxy-5-methyl-anilino)-1-phenyl-ethyl] ester MLS000391129 [2-(2-methoxy-5-methylanilino)-2-oxo-1-phenylethyl] 2-[(3,5-dimethylbenzoyl)amino]acetate cid_4660908
Type:
Small organic molecule
Emp. Form.:
C27H28N2O5
Mol. Mass.:
460.5216
SMILES:
COc1ccc(C)cc1NC(=O)C(OC(=O)CNC(=O)c1cc(C)cc(C)c1)c1ccccc1
: