Target
E3 ubiquitin-protein ligase Mdm2
Ligand
BDBM43462
Substrate
Meas. Tech.
E3 Ligase dose-response_384
EC50
3980±n/a nM
Citation
 PubChem, PC E3 Ligase dose-response_384 PubChem Bioassay (2008)[AID] 
Target
Name:
E3 ubiquitin-protein ligase Mdm2
Synonyms:
Double minute 2 protein E3 ubiquitin-protein ligase Mdm2 (p53-binding protein Mdm2) Human Double Minute 2 (HDM2) MDM2-MDMX p53-Binding Protein MDM2 | p53-binding protein
Type:
Oncoprotein
Mol. Mass.:
55196.54
Organism:
Homo sapiens (Human)
Description:
Q00987
Residue:
491
  
Inhibitor
Name:
BDBM43462
Synonyms:
2-[[(1-methyl-4-quinolinylidene)amino]methylidene]propanedinitrile 2-[[(1-methylquinolin-4-ylidene)amino]methylidene]propanedinitrile SMR000280584 | cid_789838
Type:
Small organic molecule
Emp. Form.:
C14H10N4
Mol. Mass.:
234.256
SMILES:
Cn1cc\c(=N/C=C(C#N)C#N)c2ccccc12
: