Target
E3 ubiquitin-protein ligase Mdm2
Ligand
BDBM43469
Substrate
Meas. Tech.
E3 Ligase dose-response_384
EC50
8860±n/a nM
Citation
 PubChem, PC E3 Ligase dose-response_384 PubChem Bioassay (2008)[AID] 
Target
Name:
E3 ubiquitin-protein ligase Mdm2
Synonyms:
Double minute 2 protein E3 ubiquitin-protein ligase Mdm2 (p53-binding protein Mdm2) Human Double Minute 2 (HDM2) MDM2-MDMX p53-Binding Protein MDM2 | p53-binding protein
Type:
Oncoprotein
Mol. Mass.:
55196.54
Organism:
Homo sapiens (Human)
Description:
Q00987
Residue:
491
  
Inhibitor
Name:
BDBM43469
Synonyms:
1,3-bis(4-pyridyl)urea MLS000708185 cid_1082704
Type:
Small organic molecule
Emp. Form.:
C11H10N4O
Mol. Mass.:
214.2233
SMILES:
O=C(Nc1ccncc1)Nc1ccncc1
: