Target
Signal transducer and activator of transcription 1-alpha/beta
Ligand
BDBM43505
Substrate
Meas. Tech.
Dose response cell-based assay to measure STAT1 inhibition
IC50
3467±n/a nM
Citation
 PubChem, PC Dose response cell-based assay to measure STAT1 inhibition PubChem Bioassay (2008)[AID] 
Target
Name:
Signal transducer and activator of transcription 1-alpha/beta
Synonyms:
STAT1 Signal transducer and activator of transcription 1-alpha/beta Transcription factor ISGF-3 components p91/p84 | signal transducer and activator of transcription 1 isoform alpha
Type:
Cytosolic Transcription Factor
Mol. Mass.:
87327.69
Organism:
Homo sapiens (Human)
Description:
Stat1 was expressed in sf9 cells from a baculovirus encoding the recombinant proteins. Stat1 dimer binds to DNA.
Residue:
750
  
Inhibitor
Name:
BDBM43505
Synonyms:
4-[4-(4-keto-2-thioxo-1H-quinazolin-3-yl)benzoyl]piperazine-1-carboxylic acid ethyl ester MLS000095534 cid_3244129 ethyl 4-[4-(4-oxo-2-sulfanylidene-1H-quinazolin-3-yl)benzoyl]piperazine-1-carboxylate
Type:
Small organic molecule
Emp. Form.:
C22H22N4O4S
Mol. Mass.:
438.499
SMILES:
CCOC(=O)N1CCN(CC1)C(=O)c1ccc(cc1)-n1c(=S)[nH]c2ccccc2c1=O
: