Target
Signal transducer and activator of transcription 1-alpha/beta
Ligand
BDBM43508
Substrate
Meas. Tech.
Dose response cell-based assay to measure STAT1 inhibition
IC50
9254±n/a nM
Citation
 PubChem, PC Dose response cell-based assay to measure STAT1 inhibition PubChem Bioassay (2008)[AID] 
Target
Name:
Signal transducer and activator of transcription 1-alpha/beta
Synonyms:
STAT1 Signal transducer and activator of transcription 1-alpha/beta Transcription factor ISGF-3 components p91/p84 | signal transducer and activator of transcription 1 isoform alpha
Type:
Cytosolic Transcription Factor
Mol. Mass.:
87327.69
Organism:
Homo sapiens (Human)
Description:
Stat1 was expressed in sf9 cells from a baculovirus encoding the recombinant proteins. Stat1 dimer binds to DNA.
Residue:
750
  
Inhibitor
Name:
BDBM43508
Synonyms:
MLS000526191 N-[1-(4-methyl-6-oxidanylidene-pyrimidin-1-yl)-2-oxidanylidene-2-phenyl-ethyl]benzamide N-[1-(4-methyl-6-oxopyrimidin-1-yl)-2-oxo-2-phenylethyl]benzamide SMR000116665 | cid_2802825
Type:
Small organic molecule
Emp. Form.:
C20H17N3O3
Mol. Mass.:
347.3673
SMILES:
Cc1cc(=O)n(cn1)C(NC(=O)c1ccccc1)C(=O)c1ccccc1
: