Target
Signal transducer and activator of transcription 1-alpha/beta
Ligand
BDBM43538
Substrate
Meas. Tech.
Dose response cell-based assay to measure STAT1 inhibition
IC50
13500±n/a nM
Citation
 PubChem, PC Dose response cell-based assay to measure STAT1 inhibition PubChem Bioassay (2008)[AID] 
Target
Name:
Signal transducer and activator of transcription 1-alpha/beta
Synonyms:
STAT1 Signal transducer and activator of transcription 1-alpha/beta Transcription factor ISGF-3 components p91/p84 | signal transducer and activator of transcription 1 isoform alpha
Type:
Cytosolic Transcription Factor
Mol. Mass.:
87327.69
Organism:
Homo sapiens (Human)
Description:
Stat1 was expressed in sf9 cells from a baculovirus encoding the recombinant proteins. Stat1 dimer binds to DNA.
Residue:
750
  
Inhibitor
Name:
BDBM43538
Synonyms:
1-methyl-2-[4-(4-nitrophenyl)piperazin-1-yl]carbonyl-5H-pyrrolo[3,2-c]quinolin-4-one 1-methyl-2-[[4-(4-nitrophenyl)-1-piperazinyl]-oxomethyl]-5H-pyrrolo[3,2-c]quinolin-4-one MLS000674638 cid_16195389
Type:
Small organic molecule
Emp. Form.:
C23H21N5O4
Mol. Mass.:
431.4439
SMILES:
Cn1c(cc2c1c1ccccc1[nH]c2=O)C(=O)N1CCN(CC1)c1ccc(cc1)[N+]([O-])=O
: