Target
Signal transducer and activator of transcription 3 [702-738,740-752]
Ligand
BDBM43630
Substrate
Meas. Tech.
Dose response cell-based assay to measure STAT3 activation
IC50
2496±n/a nM
Citation
 PubChem, PC Dose response cell-based assay to measure STAT3 activation PubChem Bioassay (2008)[AID] 
Target
Name:
Signal transducer and activator of transcription 3 [702-738,740-752]
Synonyms:
APRF STAT3_HUMAN
Type:
Enzyme Catalytic Domain
Mol. Mass.:
5263.93
Organism:
Homo sapiens (Human)
Description:
gi_13272532
Residue:
50
  
Inhibitor
Name:
BDBM43630
Synonyms:
MLS000735607 N-[3-[1-(3-methylphenyl)-1,3,4,9-tetrahydropyrido[3,4-b]indol-2-yl]-3-oxopropyl]acetamide NoName cid_16189105
Type:
Small organic molecule
Emp. Form.:
C23H25N3O2
Mol. Mass.:
375.4635
SMILES:
CC(=O)NCCC(=O)N1CCc2c([nH]c3ccccc23)C1c1cccc(C)c1
: