Target
Signal transducer and activator of transcription 3 [702-738,740-752]
Ligand
BDBM43663
Substrate
Meas. Tech.
Dose response counterscreen for STAT1 activators: cell-based high throughput assay to measure STAT3 activation
EC50
>55700±n/a nM
Citation
 PubChem, PC Dose response counterscreen for STAT1 activators: cell-based high throughput assay to measure STAT3 activation PubChem Bioassay (2008)[AID] 
Target
Name:
Signal transducer and activator of transcription 3 [702-738,740-752]
Synonyms:
APRF STAT3_HUMAN
Type:
Enzyme Catalytic Domain
Mol. Mass.:
5263.93
Organism:
Homo sapiens (Human)
Description:
gi_13272532
Residue:
50
  
Inhibitor
Name:
BDBM43663
Synonyms:
2-(2-chlorophenyl)-1,3-benzoxazol-5-amine SMR000035857 cid_659630
Type:
Small organic molecule
Emp. Form.:
C13H9ClN2O
Mol. Mass.:
244.676
SMILES:
Nc1ccc2oc(nc2c1)-c1ccccc1Cl
: