Target
Signal transducer and activator of transcription 3 [702-738,740-752]
Ligand
BDBM43711
Substrate
Meas. Tech.
Dose response counterscreen for STAT1 activators: cell-based high throughput assay to measure STAT3 activation
EC50
>55700±n/a nM
Citation
 PubChem, PC Dose response counterscreen for STAT1 activators: cell-based high throughput assay to measure STAT3 activation PubChem Bioassay (2008)[AID] 
Target
Name:
Signal transducer and activator of transcription 3 [702-738,740-752]
Synonyms:
APRF STAT3_HUMAN
Type:
Enzyme Catalytic Domain
Mol. Mass.:
5263.93
Organism:
Homo sapiens (Human)
Description:
gi_13272532
Residue:
50
  
Inhibitor
Name:
BDBM43711
Synonyms:
2-(4-methoxyphenyl)-5-nitro-1H-benzimidazole MLS000626894 cid_895866
Type:
Small organic molecule
Emp. Form.:
C14H11N3O3
Mol. Mass.:
269.2554
SMILES:
COc1ccc(cc1)-c1nc2ccc(cc2[nH]1)[N+]([O-])=O
: