Target
Signal transducer and activator of transcription 1-alpha/beta
Ligand
BDBM43559
Substrate
Meas. Tech.
Dose response counterscreen assay for STAT3 activators: cell-based high throughput assay to measure STAT1 activation
EC50
>55700±n/a nM
Citation
 PubChem, PC Dose response counterscreen assay for STAT3 activators: cell-based high throughput assay to measure STAT1 activation PubChem Bioassay (2008)[AID] 
Target
Name:
Signal transducer and activator of transcription 1-alpha/beta
Synonyms:
STAT1 Signal transducer and activator of transcription 1-alpha/beta Transcription factor ISGF-3 components p91/p84 | signal transducer and activator of transcription 1 isoform alpha
Type:
Cytosolic Transcription Factor
Mol. Mass.:
87327.69
Organism:
Homo sapiens (Human)
Description:
Stat1 was expressed in sf9 cells from a baculovirus encoding the recombinant proteins. Stat1 dimer binds to DNA.
Residue:
750
  
Inhibitor
Name:
BDBM43559
Synonyms:
3-amino-4-(1,3-benzothiazol-2-yl)-5-(2-furanylmethylamino)-2-thiophenecarboxylic acid ethyl ester MLS000055326 cid_2998381 ethyl 3-azanyl-4-(1,3-benzothiazol-2-yl)-5-(furan-2-ylmethylamino)thiophene-2-carboxylate
Type:
Small organic molecule
Emp. Form.:
C19H17N3O3S2
Mol. Mass.:
399.487
SMILES:
CCOC(=O)c1sc(NCc2ccco2)c(c1N)-c1nc2ccccc2s1
: