Target
Signal transducer and activator of transcription 1-alpha/beta
Ligand
BDBM43657
Substrate
Meas. Tech.
Dose response counterscreen assay for STAT3 activators: cell-based high throughput assay to measure STAT1 activation
EC50
>55700±n/a nM
Citation
 PubChem, PC Dose response counterscreen assay for STAT3 activators: cell-based high throughput assay to measure STAT1 activation PubChem Bioassay (2008)[AID] 
Target
Name:
Signal transducer and activator of transcription 1-alpha/beta
Synonyms:
STAT1 Signal transducer and activator of transcription 1-alpha/beta Transcription factor ISGF-3 components p91/p84 | signal transducer and activator of transcription 1 isoform alpha
Type:
Cytosolic Transcription Factor
Mol. Mass.:
87327.69
Organism:
Homo sapiens (Human)
Description:
Stat1 was expressed in sf9 cells from a baculovirus encoding the recombinant proteins. Stat1 dimer binds to DNA.
Residue:
750
  
Inhibitor
Name:
BDBM43657
Synonyms:
2-(1H-benzimidazol-2-ylsulfanyl)aniline;hydrochloride MLS000770492 [2-(1H-benzimidazol-2-ylthio)phenyl]amine;hydrochloride | cid_16196928
Type:
Small organic molecule
Emp. Form.:
C13H11N3S
Mol. Mass.:
241.312
SMILES:
Nc1ccccc1Sc1nc2ccccc2[nH]1
: