Target
G2/mitotic-specific cyclin-B1
Ligand
BDBM38931
Substrate
Meas. Tech.
Counterscreen assay for inhibitors of Wee1 degradation: dose response cell-based assay to identify inhibitors of cyclin B degradation
EC50
>49750±n/a nM
Citation
 PubChem, PC Counterscreen assay for inhibitors of Wee1 degradation: dose response cell-based assay to identify inhibitors of cyclin B degradation PubChem Bioassay (2008)[AID] 
Target
Name:
G2/mitotic-specific cyclin-B1
Synonyms:
CCNB CCNB1_HUMAN
Type:
Enzyme Subunit
Mol. Mass.:
48340.95
Organism:
Homo sapiens (Human)
Description:
P14635
Residue:
433
  
Inhibitor
Name:
BDBM38931
Synonyms:
6-methyl-2-[3-methyl-5-(4-methylanilino)-1-pyrazolyl]-1H-pyrimidin-4-one 6-methyl-2-[3-methyl-5-(p-toluidino)pyrazol-1-yl]-1H-pyrimidin-4-one MLS000036000 cid_2408467
Type:
Small organic molecule
Emp. Form.:
C16H17N5O
Mol. Mass.:
295.3391
SMILES:
Cc1cc(Nc2ccc(C)cc2)n(n1)-c1nc(C)cc(=O)[nH]1
: