Target
G2/mitotic-specific cyclin-B1
Ligand
BDBM43765
Substrate
Meas. Tech.
Counterscreen assay for inhibitors of Wee1 degradation: dose response cell-based assay to identify inhibitors of cyclin B degradation
EC50
>49750±n/a nM
Citation
 PubChem, PC Counterscreen assay for inhibitors of Wee1 degradation: dose response cell-based assay to identify inhibitors of cyclin B degradation PubChem Bioassay (2008)[AID] 
Target
Name:
G2/mitotic-specific cyclin-B1
Synonyms:
CCNB CCNB1_HUMAN
Type:
Enzyme Subunit
Mol. Mass.:
48340.95
Organism:
Homo sapiens (Human)
Description:
P14635
Residue:
433
  
Inhibitor
Name:
BDBM43765
Synonyms:
MLS000583103 N-(2-furfuryl)-6-propyl-benzo[b][1,4]benzothiazepine-3-carboxamide N-(furan-2-ylmethyl)-6-propyl-benzo[b][1,4]benzothiazepine-3-carboxamide SMR000206289 | cid_12005219
Type:
Small organic molecule
Emp. Form.:
C22H20N2O2S
Mol. Mass.:
376.471
SMILES:
CCCC1=Nc2cc(ccc2Sc2ccccc12)C(=O)NCc1ccco1
: